Page 2 of 3 FirstFirst 123 LastLast
Results 17 to 32 of 34

Thread: 8o!! taste hot WineX powaaah!

  1. #17
    Vive le pants! directhex's Avatar
    Join Date
    Jul 2003
    Location
    /dev/urandom
    Posts
    17,074
    Thanks
    228
    Thanked
    1,027 times in 678 posts
    • directhex's system
      • Motherboard:
      • MSI X99A Gaming 7
      • CPU:
      • Intel Core i7 5280k
      • Memory:
      • 32GiB ADATA DDR4
      • Storage:
      • Corsair Neutron XT 960GB
      • Graphics card(s):
      • MSI GTX 980 Gaming 4G Twin Frozr 5
      • PSU:
      • Corsair AX860i
      • Case:
      • NZXT H440
      • Operating System:
      • Ubuntu 17.10, Windows 10
      • Monitor(s):
      • Dell U2713HM
      • Internet:
      • FIOS
    The Big HEXUS Linux guide @ ComingSoon.com

  2. #18
    Senior Member Stubzz's Avatar
    Join Date
    Sep 2003
    Posts
    573
    Thanks
    0
    Thanked
    0 times in 0 posts
    The biggest braggin rights, getting Far Cry working under linux

    Pics tomorrow...

  3. #19
    Vive le pants! directhex's Avatar
    Join Date
    Jul 2003
    Location
    /dev/urandom
    Posts
    17,074
    Thanks
    228
    Thanked
    1,027 times in 678 posts
    • directhex's system
      • Motherboard:
      • MSI X99A Gaming 7
      • CPU:
      • Intel Core i7 5280k
      • Memory:
      • 32GiB ADATA DDR4
      • Storage:
      • Corsair Neutron XT 960GB
      • Graphics card(s):
      • MSI GTX 980 Gaming 4G Twin Frozr 5
      • PSU:
      • Corsair AX860i
      • Case:
      • NZXT H440
      • Operating System:
      • Ubuntu 17.10, Windows 10
      • Monitor(s):
      • Dell U2713HM
      • Internet:
      • FIOS
    you mean running the unofficial far cry linux installer? only cos i don't own the game tbh

  4. #20
    Senior Member Stubzz's Avatar
    Join Date
    Sep 2003
    Posts
    573
    Thanks
    0
    Thanked
    0 times in 0 posts
    Never knew about them, I just ran it off of my windows partition

  5. #21
    HEXUS webmaster Steve's Avatar
    Join Date
    Nov 2003
    Location
    Bristol
    Posts
    14,268
    Thanks
    286
    Thanked
    828 times in 468 posts
    • Steve's system
      • CPU:
      • Intel i3-350M 2.27GHz
      • Memory:
      • 8GiB Crucial DDR3
      • Storage:
      • 320GB HDD
      • Graphics card(s):
      • Intel HD3000
      • Operating System:
      • Ubuntu 11.10
    Erm...
    Code:
    Compiling ...
                                                                                    
                                                                                    
                                                                                    
                                                                                    
    --------- Error log - file /home/unts/temp/cvswinex/ErrorLog : ---------
    ts_xlib.c: In function `TSXOpenIM':
    ts_xlib.c:1176: error: `XIM' undeclared (first use in this function)
    ts_xlib.c:1176: error: parse error before "r"
    ts_xlib.c:1178: error: `r' undeclared (first use in this function)
    ts_xlib.c:1178: warning: implicit declaration of function `XOpenIM'
    ts_xlib.c:1178: error: `a0' undeclared (first use in this function)
    ts_xlib.c:1178: error: `a1' undeclared (first use in this function)
    ts_xlib.c:1178: error: `a2' undeclared (first use in this function)
    ts_xlib.c:1178: error: `a3' undeclared (first use in this function)
    ts_xlib.c: At top level:
    ts_xlib.c:1183: error: parse error before "TSXCheckIfEvent"
    ts_xlib.c:1183: error: parse error before '*' token
    ts_xlib.c:1183: warning: type defaults to `int' in declaration of `TSXCheckIfEvent'
    ts_xlib.c:1183: error: `TSXCheckIfEvent' declared as function returning a function
    ts_xlib.c:1183: warning: type defaults to `int' in declaration of `XPointer'
    ts_xlib.c:1183: error: parse error before "a3"
    ts_xlib.c:1186: warning: type defaults to `int' in declaration of `wine_tsx11_lock'
    ts_xlib.c:1186: error: `wine_tsx11_lock' redeclared as different kind of symbol
    ../include/ts_xlib.h:19: error: previous declaration of `wine_tsx11_lock'
    ts_xlib.c:1186: warning: data definition has no type or storage class
    ts_xlib.c:1187: warning: type defaults to `int' in declaration of `r'
    ts_xlib.c:1187: error: `r' used prior to declaration
    ts_xlib.c:1187: warning: implicit declaration of function `XCheckIfEvent'
    ts_xlib.c:1187: error: `a0' undeclared here (not in a function)
    ts_xlib.c:1187: error: `a1' undeclared here (not in a function)
    ts_xlib.c:1187: error: `a2' undeclared here (not in a function)
    ts_xlib.c:1187: error: `a3' undeclared here (not in a function)
    ts_xlib.c:1187: error: initializer element is not constant
    ts_xlib.c:1187: warning: data definition has no type or storage class
    ts_xlib.c:1188: warning: type defaults to `int' in declaration of `wine_tsx11_unlock'
    ts_xlib.c:1188: error: `wine_tsx11_unlock' redeclared as different kind of symbol
    ../include/ts_xlib.h:20: error: previous declaration of `wine_tsx11_unlock'
    ts_xlib.c:1188: warning: data definition has no type or storage class
    ts_xlib.c:1189: error: parse error before "return"
    ts_xlib.c:1192: error: parse error before '*' token
    ts_xlib.c:1192: error: parse error before '*' token
    ts_xlib.c: In function `TSXSynchronize':
    ts_xlib.c:1194: error: parse error before '*' token
    ts_xlib.c:1196: warning: implicit declaration of function `XSynchronize'
    ts_xlib.c:1196: error: `a0' undeclared (first use in this function)
    ts_xlib.c:1196: error: `a1' undeclared (first use in this function)
    ts_xlib.c:1196: warning: assignment makes pointer from integer without a cast
    ts_xlib.c: At top level:
    ts_xlib.c:1201: error: parse error before '*' token
    ts_xlib.c:1203: error: parse error before '*' token
    ts_xlib.c: In function `TS_XInitImageFuncPtrs':
    ts_xlib.c:1206: error: `a0' undeclared (first use in this function)
    make[1]: *** [ts_xlib.o] Error 1
    make[1]: Leaving directory `/home/unts/temp/cvswinex/winex/tsx11'
    make: *** [tsx11/libwine_tsx11.so] Error 2
     
     
    Error in Make
     
    Try fixing the error based on the output above, and
    run the script again, without paramaters (Eg: GetCVSWineX_Pthreads)
    Help?
    PHP Code:
    $s = new signature();
    $s->sarcasm()->intellect()->font('Courier New')->display(); 

  6. #22
    Vive le pants! directhex's Avatar
    Join Date
    Jul 2003
    Location
    /dev/urandom
    Posts
    17,074
    Thanks
    228
    Thanked
    1,027 times in 678 posts
    • directhex's system
      • Motherboard:
      • MSI X99A Gaming 7
      • CPU:
      • Intel Core i7 5280k
      • Memory:
      • 32GiB ADATA DDR4
      • Storage:
      • Corsair Neutron XT 960GB
      • Graphics card(s):
      • MSI GTX 980 Gaming 4G Twin Frozr 5
      • PSU:
      • Corsair AX860i
      • Case:
      • NZXT H440
      • Operating System:
      • Ubuntu 17.10, Windows 10
      • Monitor(s):
      • Dell U2713HM
      • Internet:
      • FIOS
    Quote Originally Posted by kez
    Erm...
    Code:
    Compiling ...
                                                                                    
                                                                                    
                                                                                    
                                                                                    
    --------- Error log - file /home/unts/temp/cvswinex/ErrorLog : ---------
    ts_xlib.c: In function `TSXOpenIM':
    ts_xlib.c:1176: error: `XIM' undeclared (first use in this function)
    ts_xlib.c:1176: error: parse error before "r"
    ts_xlib.c:1178: error: `r' undeclared (first use in this function)
    ts_xlib.c:1178: warning: implicit declaration of function `XOpenIM'
    ts_xlib.c:1178: error: `a0' undeclared (first use in this function)
    ts_xlib.c:1178: error: `a1' undeclared (first use in this function)
    ts_xlib.c:1178: error: `a2' undeclared (first use in this function)
    ts_xlib.c:1178: error: `a3' undeclared (first use in this function)
    ts_xlib.c: At top level:
    ts_xlib.c:1183: error: parse error before "TSXCheckIfEvent"
    ts_xlib.c:1183: error: parse error before '*' token
    ts_xlib.c:1183: warning: type defaults to `int' in declaration of `TSXCheckIfEvent'
    ts_xlib.c:1183: error: `TSXCheckIfEvent' declared as function returning a function
    ts_xlib.c:1183: warning: type defaults to `int' in declaration of `XPointer'
    ts_xlib.c:1183: error: parse error before "a3"
    ts_xlib.c:1186: warning: type defaults to `int' in declaration of `wine_tsx11_lock'
    ts_xlib.c:1186: error: `wine_tsx11_lock' redeclared as different kind of symbol
    ../include/ts_xlib.h:19: error: previous declaration of `wine_tsx11_lock'
    ts_xlib.c:1186: warning: data definition has no type or storage class
    ts_xlib.c:1187: warning: type defaults to `int' in declaration of `r'
    ts_xlib.c:1187: error: `r' used prior to declaration
    ts_xlib.c:1187: warning: implicit declaration of function `XCheckIfEvent'
    ts_xlib.c:1187: error: `a0' undeclared here (not in a function)
    ts_xlib.c:1187: error: `a1' undeclared here (not in a function)
    ts_xlib.c:1187: error: `a2' undeclared here (not in a function)
    ts_xlib.c:1187: error: `a3' undeclared here (not in a function)
    ts_xlib.c:1187: error: initializer element is not constant
    ts_xlib.c:1187: warning: data definition has no type or storage class
    ts_xlib.c:1188: warning: type defaults to `int' in declaration of `wine_tsx11_unlock'
    ts_xlib.c:1188: error: `wine_tsx11_unlock' redeclared as different kind of symbol
    ../include/ts_xlib.h:20: error: previous declaration of `wine_tsx11_unlock'
    ts_xlib.c:1188: warning: data definition has no type or storage class
    ts_xlib.c:1189: error: parse error before "return"
    ts_xlib.c:1192: error: parse error before '*' token
    ts_xlib.c:1192: error: parse error before '*' token
    ts_xlib.c: In function `TSXSynchronize':
    ts_xlib.c:1194: error: parse error before '*' token
    ts_xlib.c:1196: warning: implicit declaration of function `XSynchronize'
    ts_xlib.c:1196: error: `a0' undeclared (first use in this function)
    ts_xlib.c:1196: error: `a1' undeclared (first use in this function)
    ts_xlib.c:1196: warning: assignment makes pointer from integer without a cast
    ts_xlib.c: At top level:
    ts_xlib.c:1201: error: parse error before '*' token
    ts_xlib.c:1203: error: parse error before '*' token
    ts_xlib.c: In function `TS_XInitImageFuncPtrs':
    ts_xlib.c:1206: error: `a0' undeclared (first use in this function)
    make[1]: *** [ts_xlib.o] Error 1
    make[1]: Leaving directory `/home/unts/temp/cvswinex/winex/tsx11'
    make: *** [tsx11/libwine_tsx11.so] Error 2
     
     
    Error in Make
     
    Try fixing the error based on the output above, and
    run the script again, without paramaters (Eg: GetCVSWineX_Pthreads)
    Help?
    Quote Originally Posted by directhex
    one of the missing packages was called flex, so i apt-get installed it. winex then b0rked during compile. a quick google showed i need an old version of flex to compile winex, handily provided as flex-old

  7. #23
    HEXUS webmaster Steve's Avatar
    Join Date
    Nov 2003
    Location
    Bristol
    Posts
    14,268
    Thanks
    286
    Thanked
    828 times in 468 posts
    • Steve's system
      • CPU:
      • Intel i3-350M 2.27GHz
      • Memory:
      • 8GiB Crucial DDR3
      • Storage:
      • 320GB HDD
      • Graphics card(s):
      • Intel HD3000
      • Operating System:
      • Ubuntu 11.10
    That was the first thing I did, hex!

    Still didn't work.
    PHP Code:
    $s = new signature();
    $s->sarcasm()->intellect()->font('Courier New')->display(); 

  8. #24
    Vive le pants! directhex's Avatar
    Join Date
    Jul 2003
    Location
    /dev/urandom
    Posts
    17,074
    Thanks
    228
    Thanked
    1,027 times in 678 posts
    • directhex's system
      • Motherboard:
      • MSI X99A Gaming 7
      • CPU:
      • Intel Core i7 5280k
      • Memory:
      • 32GiB ADATA DDR4
      • Storage:
      • Corsair Neutron XT 960GB
      • Graphics card(s):
      • MSI GTX 980 Gaming 4G Twin Frozr 5
      • PSU:
      • Corsair AX860i
      • Case:
      • NZXT H440
      • Operating System:
      • Ubuntu 17.10, Windows 10
      • Monitor(s):
      • Dell U2713HM
      • Internet:
      • FIOS
    trying to find a solution.

    it's possible that the CVS isn't 10% working at the moment, but I can see reference to the same set of errors elsewhere.

    hrm.....

  9. #25
    Vive le pants! directhex's Avatar
    Join Date
    Jul 2003
    Location
    /dev/urandom
    Posts
    17,074
    Thanks
    228
    Thanked
    1,027 times in 678 posts
    • directhex's system
      • Motherboard:
      • MSI X99A Gaming 7
      • CPU:
      • Intel Core i7 5280k
      • Memory:
      • 32GiB ADATA DDR4
      • Storage:
      • Corsair Neutron XT 960GB
      • Graphics card(s):
      • MSI GTX 980 Gaming 4G Twin Frozr 5
      • PSU:
      • Corsair AX860i
      • Case:
      • NZXT H440
      • Operating System:
      • Ubuntu 17.10, Windows 10
      • Monitor(s):
      • Dell U2713HM
      • Internet:
      • FIOS
    try apt-get install x-window-system-dev

    if there's a missing development library, it'll be in there

  10. #26
    HEXUS webmaster Steve's Avatar
    Join Date
    Nov 2003
    Location
    Bristol
    Posts
    14,268
    Thanks
    286
    Thanked
    828 times in 468 posts
    • Steve's system
      • CPU:
      • Intel i3-350M 2.27GHz
      • Memory:
      • 8GiB Crucial DDR3
      • Storage:
      • 320GB HDD
      • Graphics card(s):
      • Intel HD3000
      • Operating System:
      • Ubuntu 11.10
    Will try that in a couple of hours. Thanks!
    PHP Code:
    $s = new signature();
    $s->sarcasm()->intellect()->font('Courier New')->display(); 

  11. #27
    HEXUS webmaster Steve's Avatar
    Join Date
    Nov 2003
    Location
    Bristol
    Posts
    14,268
    Thanks
    286
    Thanked
    828 times in 468 posts
    • Steve's system
      • CPU:
      • Intel i3-350M 2.27GHz
      • Memory:
      • 8GiB Crucial DDR3
      • Storage:
      • 320GB HDD
      • Graphics card(s):
      • Intel HD3000
      • Operating System:
      • Ubuntu 11.10
    That apt-get string has set my computer off downloading a mere 40MB of new files, lol.

    Perhaps make will work once that's finished, hehe.

    Many cheers to you!
    PHP Code:
    $s = new signature();
    $s->sarcasm()->intellect()->font('Courier New')->display(); 

  12. #28
    HEXUS webmaster Steve's Avatar
    Join Date
    Nov 2003
    Location
    Bristol
    Posts
    14,268
    Thanks
    286
    Thanked
    828 times in 468 posts
    • Steve's system
      • CPU:
      • Intel i3-350M 2.27GHz
      • Memory:
      • 8GiB Crucial DDR3
      • Storage:
      • 320GB HDD
      • Graphics card(s):
      • Intel HD3000
      • Operating System:
      • Ubuntu 11.10
    Well that seemed to work - it's compiled and installed.

    The only problem is my RAID array doesn't work under Kernel 2.6 (SATA RAID.)

    I've patched support for it and am recompiling now - then I should be able to get at me games!
    PHP Code:
    $s = new signature();
    $s->sarcasm()->intellect()->font('Courier New')->display(); 

  13. #29
    Vive le pants! directhex's Avatar
    Join Date
    Jul 2003
    Location
    /dev/urandom
    Posts
    17,074
    Thanks
    228
    Thanked
    1,027 times in 678 posts
    • directhex's system
      • Motherboard:
      • MSI X99A Gaming 7
      • CPU:
      • Intel Core i7 5280k
      • Memory:
      • 32GiB ADATA DDR4
      • Storage:
      • Corsair Neutron XT 960GB
      • Graphics card(s):
      • MSI GTX 980 Gaming 4G Twin Frozr 5
      • PSU:
      • Corsair AX860i
      • Case:
      • NZXT H440
      • Operating System:
      • Ubuntu 17.10, Windows 10
      • Monitor(s):
      • Dell U2713HM
      • Internet:
      • FIOS
    hurrah, i fixed it! \o/

    before long i'll be a proper greasy-hair-and-beard linux hippy

  14. #30
    Member
    Join Date
    May 2004
    Location
    notts, uk :>
    Posts
    131
    Thanks
    0
    Thanked
    0 times in 0 posts
    how much time would you say you took, or the average fool would take to get winex setup ?

    just wondering if it was a simple process to get steam working like that, or any hickups etc.
    slightly off, what exactly is ALSA ? could do with figuring out some sound setup for me, spose i need to research nf2 soundstorm on linux
    er, if your northbridge fan is humming loudly, disconnect it. _dont_ kick the side of the case, it _will_ break it.
    i know :/

  15. #31
    HEXUS webmaster Steve's Avatar
    Join Date
    Nov 2003
    Location
    Bristol
    Posts
    14,268
    Thanks
    286
    Thanked
    828 times in 468 posts
    • Steve's system
      • CPU:
      • Intel i3-350M 2.27GHz
      • Memory:
      • 8GiB Crucial DDR3
      • Storage:
      • 320GB HDD
      • Graphics card(s):
      • Intel HD3000
      • Operating System:
      • Ubuntu 11.10
    ALSA stands for Advanced Linux Sound Architecture, if I remember rightly. I'm sure directhex will correct me if wrong, as he's got it working and I haven't
    PHP Code:
    $s = new signature();
    $s->sarcasm()->intellect()->font('Courier New')->display(); 

  16. #32
    Vive le pants! directhex's Avatar
    Join Date
    Jul 2003
    Location
    /dev/urandom
    Posts
    17,074
    Thanks
    228
    Thanked
    1,027 times in 678 posts
    • directhex's system
      • Motherboard:
      • MSI X99A Gaming 7
      • CPU:
      • Intel Core i7 5280k
      • Memory:
      • 32GiB ADATA DDR4
      • Storage:
      • Corsair Neutron XT 960GB
      • Graphics card(s):
      • MSI GTX 980 Gaming 4G Twin Frozr 5
      • PSU:
      • Corsair AX860i
      • Case:
      • NZXT H440
      • Operating System:
      • Ubuntu 17.10, Windows 10
      • Monitor(s):
      • Dell U2713HM
      • Internet:
      • FIOS
    nope, that's it. www.alsa-project.org

    essentially, linux has (had) a standardised driver, called OSS. it sucked (e.g. only one sound at once possible), and a replacement system was developed by SUSE primarily - ALSA. ALSA replaced OSS in the latest version of the linux kernel. getting it fully working's a bit of a task, though. partly (i.e. playing one sound at once using the ALSA driver instead of OSS) didn't take too long

    winex (& steam by extension) was pretty easy, all things considered.

    it'll all be going itno my big guide.

Page 2 of 3 FirstFirst 123 LastLast

Thread Information

Users Browsing this Thread

There are currently 1 users browsing this thread. (0 members and 1 guests)

Similar Threads

  1. How hot is too hot?
    By Benjamin in forum PC Hardware and Components
    Replies: 18
    Last Post: 07-02-2004, 05:39 PM
  2. I wanna wash my car but it's to hot :(
    By Trash Man in forum Automotive
    Replies: 15
    Last Post: 05-08-2003, 05:38 PM

Posting Permissions

  • You may not post new threads
  • You may not post replies
  • You may not post attachments
  • You may not edit your posts
  •